5-Cholenoic acid, 3-β-ol, TMS

Kovats' RI, non-polar column, temperature ramp

View large format table.

Column type Active phase I Reference Comment
CapillaryMethyl Silicone3197.Shoda, Axelson, et al., 199325. m/0.32 mm/0.25 μm, 30. K/min; Tstart: 60. C; Tend: 290. C

References

Shoda, Axelson, et al., 1993
Shoda, J.; Axelson, M.; Sjövall, J., Synthesis of potential C27-intermediates in bile acid biosynthesis and their deuterium-labeled analogs, Steroids, 1993, 58, 3, 119-125, https://doi.org/10.1016/0039-128X(93)90048-R . [all data]