4-Cholestenoic acid, 7-α-ol-3-one, TMS

Kovats' RI, non-polar column, temperature ramp

Data compiled by: NIST Mass Spectrometry Data Center, William E. Wallace, director

Column type Capillary
Active phase Methyl Silicone
Column length (m) 25.
Carrier gas
Substrate
Column diameter (mm) 0.32
Phase thickness (μm) 0.25
Tstart (C) 60.
Tend (C) 290.
Heat rate (K/min) 30.
Initial hold (min)
Final hold (min)
I 3564.
ReferenceShoda, Axelson, et al., 1993
Comment MSDC-RI

References

Shoda, Axelson, et al., 1993
Shoda, J.; Axelson, M.; Sjövall, J., Synthesis of potential C27-intermediates in bile acid biosynthesis and their deuterium-labeled analogs, Steroids, 1993, 58, 3, 119-125, https://doi.org/10.1016/0039-128X(93)90048-R . [all data]