2,6-diisothiocyanato-hexanoic acid ethyl ester

Kovats' RI, non-polar column, isothermal

View large format table.

Column type Active phase Temperature (C) I Reference Comment
PackedUCW-98160.1847.1Rajniaková and Floch, 1993N2, Chromosorb WAW DNCS; Column length: 1.8 m

References

Rajniaková and Floch, 1993
Rajniaková, O.; Floch, L., Study of the properties of ethyl isothiocyanatocarboxylates by means of gas chromatography and mass spectroscopy, Chem. Pap., 1993, 47, 2, 106-108. [all data]