12α-hydroxy-GA37 methyl ester TMS ether

Van Den Dool and Kratz RI, non-polar column, custom temperature program

View large format table.

Column type Active phase I Reference Comment
CapillaryOV-12953.Gaskin, Hutchison, et al., 1984Program: not specified

Normal alkane RI, non-polar column, custom temperature program

View large format table.

Column type Active phase I Reference Comment
CapillaryDB-12977.Lange, Hedden, et al., 199325. m/0.32 mm/0.33 μm, He; Program: 50C(1min) => 20C/min => 240C => 4C/min => 295C
CapillaryBP-12991.Lange, Hedden, et al., 1993, 225. m/0.25 mm/0.33 μm, He; Program: 60C(1min) => 20C/min => 240C => 4C/min => 300C

References

Gaskin, Hutchison, et al., 1984
Gaskin, P.; Hutchison, M.; Lewis, N.; MacMillan, J.; Phinney, B.O., Microbiological conversion of 12-oxygenated and other derivatives of ent-kaur-16-en-19-oic acid by Gibberella Fujikuroi, mutant B1-41a, Phytochemistry, 1984, 23, 3, 559-564, https://doi.org/10.1016/S0031-9422(00)80380-5 . [all data]

Lange, Hedden, et al., 1993
Lange, T.; Hedden, P.; Graebe, J.E., Biosynthesis of 12α- and 13-hydroxylated gibberellins in a cell-free system from Cucurbita maxima endosperm and the identification of new endogenous gibberellins, Planta, 1993, 189, 3, 340-349, https://doi.org/10.1007/BF00194430 . [all data]

Lange, Hedden, et al., 1993, 2
Lange, T.; Hedden, P.; Graebe, J.E., Gibberellin biosynthesis in cell-free extracts from developing Cucurbita maxima embryos and the identification of new endogenous gibberellins, Planta, 1993, 189, 3, 350-358, https://doi.org/10.1007/BF00194431 . [all data]