[14C1]GA4 methyl ester TMS ether

Normal alkane RI, non-polar column, custom temperature program

Data compiled by: NIST Mass Spectrometry Data Center, William E. Wallace, director

Column type CapillaryCapillaryCapillaryCapillaryCapillary
Active phase SE-30SE-30SE-30SE-30SE-30
Column length (m) 25.25.25.25.25.
Carrier gas
Substrate
Column diameter (mm) 0.250.250.250.250.25
Phase thickness (μm) 0.250.250.250.250.25
Program 60 (2min) => 20C/min => 200C => 4C/min => 260C60 (2min) => 20C/min => 200C => 4C/min => 260C60 (2min) => 20C/min => 200C => 4C/min => 260C60 (2min) => 20C/min => 200C => 4C/min => 260C60 (2min) => 20C/min => 200C => 4C/min => 260C
I 2515.2517.2517.2517.2517.
ReferenceWang, Little, et al., 1996Wang, Little, et al., 1996Wang, Little, et al., 1996Wang, Little, et al., 1996Wang, Little, et al., 1996
Comment MSDC-RI MSDC-RI MSDC-RI MSDC-RI MSDC-RI
Column type Capillary
Active phase SE-30
Column length (m) 25.
Carrier gas
Substrate
Column diameter (mm) 0.25
Phase thickness (μm) 0.25
Program 60 (2min) => 20C/min => 200C => 4C/min => 260C
I 2518.
ReferenceWang, Little, et al., 1996
Comment MSDC-RI

Kovats' RI, non-polar column, custom temperature program

Data compiled by: NIST Mass Spectrometry Data Center, William E. Wallace, director

Column type Capillary
Active phase SE-30
Column length (m) 25.
Carrier gas
Substrate
Column diameter (mm) 0.25
Phase thickness (μm) 0.25
Program 80C(1min) => (20C/min) => 200C => (4C/min) => 250C
I 2521.
ReferenceOdén, Wang, et al., 1995
Comment MSDC-RI

References

Wang, Little, et al., 1996
Wang, Q.; Little, C.H.A.; Moritz, T.; Odén, P.C., Identification of endogenous gibberellins, and metabolism of tritiated and deuterated GA4, GA9, and GA20, in Scots pine (Pinus sylvestris) shoots, Physiol. Plant., 1996, 97, 4, 764-771, https://doi.org/10.1111/j.1399-3054.1996.tb00542.x . [all data]