16α,17-H2 (OH)2 GA4, MeTMS

Van Den Dool and Kratz RI, non-polar column, custom temperature program

View large format table.

Column type Active phase I Reference Comment
CapillaryOV-12926.Santes, Hedden, et al., 199525. m/0.2 mm/0.25 μm; Program: 60C(2min) => 10C/min => 150C => 3C/min => 300C
CapillaryOV-12932.Santes, Hedden, et al., 199525. m/0.2 mm/0.25 μm; Program: 60C(2min) => 10C/min => 150C => 3C/min => 300C
CapillaryOV-12932.Kobayashi, Gaskin, et al., 199325. m/0.2 mm/0.25 μm; Program: 50C(2min) => 10C/min => 150C => 3C/min => 300C
CapillaryOV-12932.Kobayashi, Gaskin, et al., 199325. m/0.2 mm/0.25 μm; Program: 50C(2min) => 10C/min => 150C => 3C/min => 300C

Normal alkane RI, non-polar column, custom temperature program

View large format table.

Column type Active phase I Reference Comment
CapillaryUltra-12923.Hasegawa, Nakajima, et al., 1994He; Column length: 25. m; Column diameter: 0.2 mm; Program: 60C (1.5min) => 20C/min => 200C => 5C/min => 280C (15min)
CapillaryUltra-12925.Hasegawa, Nakajima, et al., 1994He; Column length: 25. m; Column diameter: 0.2 mm; Program: 60C (1.5min) => 20C/min => 200C => 5C/min => 280C (15min)
CapillaryUltra-12929.Hasegawa, Nakajima, et al., 1994He; Column length: 25. m; Column diameter: 0.2 mm; Program: 60C (1.5min) => 20C/min => 200C => 5C/min => 280C (15min)
CapillaryUltra-12929.Hasegawa, Nakajima, et al., 1994He; Column length: 25. m; Column diameter: 0.2 mm; Program: 60C (1.5min) => 20C/min => 200C => 5C/min => 280C (15min)
CapillaryUltra-12891.Hasegawa, Nakajima, et al., 1994He; Column length: 25. m; Column diameter: 0.2 mm; Program: 60C (1.5min) => 20C/min => 200C => 5C/min => 280C (15min)

References

Santes, Hedden, et al., 1995
Santes, C.M.; Hedden, P.; Gaskin, P.; Garcia-Martinez, J.L., Gibberellins and related compounds in young fruits of pea and their relationship to fruit-set, Phytochemistry, 1995, 40, 5, 1347-1355, https://doi.org/10.1016/0031-9422(95)00489-T . [all data]

Kobayashi, Gaskin, et al., 1993
Kobayashi, M.; Gaskin, P.; Spray, C.R.; Suzuki, Y.; Phinney, B.O.; MacMillan, J., Metabolism and biological activity of Gibberellin A4 in vegetative shoots of Zea mays, Oryza sativa, and Arabidopsis thaliana, Plant Physiol., 1993, 102, 379-386. [all data]

Hasegawa, Nakajima, et al., 1994
Hasegawa, M.; Nakajima, M.; Takeda, K.; Yamaguchi, I.; Murofushi, N., A novel gibberellin glucoside, 16α,17-dihydroxy-16,17-dihydrogibberellin A4-17-O-β-D-glucopyranoside, from rice anthers, Phytochemistry, 1994, 37, 3, 629-634, https://doi.org/10.1016/S0031-9422(00)90329-7 . [all data]