[13C]15-epi-GA63 methyl ester TMS ether

Van Den Dool and Kratz RI, non-polar column, custom temperature program

Data compiled by: NIST Mass Spectrometry Data Center, William E. Wallace, director

Column type Capillary
Active phase OV-1
Column length (m) 25.
Carrier gas
Substrate
Column diameter (mm) 0.2
Phase thickness (μm) 0.25
Program 50C(2min) => 10C/min => 150C => 3C/min => 300C
I 2786.
ReferenceKobayashi, Gaskin, et al., 1993
Comment MSDC-RI

References

Kobayashi, Gaskin, et al., 1993
Kobayashi, M.; Gaskin, P.; Spray, C.R.; Suzuki, Y.; Phinney, B.O.; MacMillan, J., Metabolism and biological activity of Gibberellin A4 in vegetative shoots of Zea mays, Oryza sativa, and Arabidopsis thaliana, Plant Physiol., 1993, 102, 379-386. [all data]