17-OH-GA53, MeTMS

Kovats' RI, non-polar column, custom temperature program

Data compiled by: NIST Mass Spectrometry Data Center, William E. Wallace, director

Column type CapillaryCapillaryCapillaryCapillary
Active phase Ultra-2Ultra-2Ultra-2Ultra-2
Column length (m) 25.25.25.25.
Carrier gas
Substrate
Column diameter (mm) 0.320.320.320.32
Phase thickness (μm) 0.520.520.520.52
Program 50C => 40C/min => 220C => 6C/min => 280C50C => 40C/min => 220C => 6C/min => 280C50C => 40C/min => 220C => 6C/min => 280C50C => 40C/min => 220C => 6C/min => 280C
I 2708.2708.2709.2709.
ReferenceTalon M., Koornneef M., et al., 1990Talon, Koornneef, et al., 1990Talon, Koornneef, et al., 1990Talon, Koornneef, et al., 1990
Comment MSDC-RI MSDC-RI MSDC-RI MSDC-RI

Normal alkane RI, non-polar column, custom temperature program

View large format table.

Column type Active phase I Reference Comment
CapillaryUltra 22707.Talon, Zacarias, et al., 199222. m/0.32 mm/0.52 μm, Helium; Program: not specified
CapillaryUltra-22707.Talon, Zeevaart, et al., 199125. m/0.32 mm/0.52 μm; Program: 50C => 40C/min => 220C => 8C/min => 280C

References

Talon M., Koornneef M., et al., 1990
Talon M.; Koornneef M.; Zeevaart J.A.D., Accumulation of C19-gibberelins in the gibbrellin-insensitive dwarf mutant gai if Arabidopsis thaliana (L.) Heynh, Planta, 1990, 182, 4, 501-505, https://doi.org/10.1007/BF02341024 . [all data]

Talon, Koornneef, et al., 1990
Talon, M.; Koornneef, M.; Zeevaart, J.A.D., Endogenous gibberellins in Arabidopsis thaliana and possible steps blocked in the biosynthetic pathways of the semidwarf ga4 and ga5 mutants, Proc. Nat. Acad. Sci. U.S.A., 1990, 87, 20, 7983-7987, https://doi.org/10.1073/pnas.87.20.7983 . [all data]