3-methyl, 3,5-diethyl, heptane

Kovats' RI, non-polar column, isothermal

Data compiled by: NIST Mass Spectrometry Data Center, William E. Wallace, director

Column type Capillary
Active phase SE-30
Column length (m) 30.
Carrier gas
Substrate
Column diameter (mm) 0.25
Phase thickness (μm)
Temperature (C) 70.
I 1112.4
ReferenceLaet and Tilquin, 1991
Comment MSDC-RI

References

Laet and Tilquin, 1991
Laet, M.; Tilquin, B., Identification d'isomeres du dodecane mesures des indices de retention a plusieurs temperatures, Bull. Soc. Chim. Belg., 1991, 100, 4, 345-355, https://doi.org/10.1002/bscb.19911000408 . [all data]