Furazabol, 17-TMS

Normal alkane RI, non-polar column, temperature ramp

Data compiled by: NIST Mass Spectrometry Data Center, William E. Wallace, director

Column type Capillary
Active phase SE-54
Column length (m) 17.
Carrier gas
Substrate
Column diameter (mm)
Phase thickness (μm) 0.33
Tstart (C) 200.
Tend (C) 320.
Heat rate (K/min) 5.
Initial hold (min)
Final hold (min)
I 2994.
ReferenceSchänzer, Opfermann, et al., 1992
Comment MSDC-RI

References

Schänzer, Opfermann, et al., 1992
Schänzer, W.; Opfermann, G.; Donike, M., 17-Epimerization of 17α-methyl anabolic steroids in humans: metabolism and synthesis of 17α-hydroxy-17β-methyl steroids, Steroids, 1992, 57, 11, 537-550, https://doi.org/10.1016/0039-128X(92)90023-3 . [all data]