1,7-dibromo,2,8-dichloro-dibenzo-dioxin

Van Den Dool and Kratz RI, non-polar column, temperature ramp

View large format table.

Column type Active phase I Reference Comment
CapillaryRTX-52583.Donnelly and Sovocool, 199130. m/0.25 mm/0.25 μm, He, 170. C @ 1. min, 2. K/min; Tend: 320. C

References

Donnelly and Sovocool, 1991
Donnelly, J.R.; Sovocool, G.W., Predictions of bromo- and bromochloro- dioxin GC elution properties, Chemosphere, 1991, 22, 5-6, 455-460, https://doi.org/10.1016/0045-6535(91)90057-K . [all data]