1,2,4-tribromo,3-chloro-dibenzo-dioxin

Van Den Dool and Kratz RI, non-polar column, temperature ramp

Data compiled by: NIST Mass Spectrometry Data Center, William E. Wallace, director

Column type Capillary
Active phase RTX-5
Column length (m) 30.
Carrier gas He
Substrate
Column diameter (mm) 0.25
Phase thickness (μm) 0.25
Tstart (C) 170.
Tend (C) 320.
Heat rate (K/min) 2.
Initial hold (min) 1.
Final hold (min)
I 2707.
ReferenceDonnelly and Sovocool, 1991
Comment MSDC-RI

References

Donnelly and Sovocool, 1991
Donnelly, J.R.; Sovocool, G.W., Predictions of bromo- and bromochloro- dioxin GC elution properties, Chemosphere, 1991, 22, 5-6, 455-460, https://doi.org/10.1016/0045-6535(91)90057-K . [all data]