2,3,7-tribromo-1,9-dichloro-dibenzo-p-dioxin

Van Den Dool and Kratz RI, non-polar column, temperature ramp

Data compiled by: NIST Mass Spectrometry Data Center, William E. Wallace, director

Column type CapillaryCapillary
Active phase RTX-5RTX-5
Column length (m) 30.30.
Carrier gas HeHe
Substrate
Column diameter (mm) 0.250.25
Phase thickness (μm) 0.250.25
Tstart (C) 170.170.
Tend (C) 320.320.
Heat rate (K/min) 2.2.
Initial hold (min) 1.1.
Final hold (min)
I 2875.2875.
ReferenceDonnelly, Munslow, et al., 1991Donnelly, Munslow, et al., 1991, 2
Comment MSDC-RI MSDC-RI

References

Donnelly, Munslow, et al., 1991
Donnelly, J.R.; Munslow, W.D.; Grange, A.H.; Pettit, T.L.; Simmons, R.D.; Sovocool, G.W., Correlation of structure with linear retention index for bromo- and bromochlorodibenzo-p-dioxins and bromodibenzofurans, J. Chromatogr., 1991, 540, 293-310, https://doi.org/10.1016/S0021-9673(01)88817-8 . [all data]

Donnelly, Munslow, et al., 1991, 2
Donnelly, J.R.; Munslow, W.D.; Grange, A.H.; Pettit, T.L.; Simmons, R.D.; Kumar, K.S.; Sovocool, G.W., A gas chromatographic/mass spectrometric approach for isomer-specific environmental monitoring of the 1700 bromo-, chloro-, and bromoschloro-dibenzo-p-dioxins, Biol. Mass Spectrom., 1991, 20, 5, 329-337, https://doi.org/10.1002/bms.1200200515 . [all data]