Methyltestosterone, HFB

Van Den Dool and Kratz RI, non-polar column, temperature ramp

View large format table.

Column type Active phase I Reference Comment
CapillaryUltra-22272.Daeseleire, de Guesquiere, et al., 199125. m/0.2 mm/0.33 μm, He, 5. K/min, 280. C @ 10. min; Tstart: 200. C

References

Daeseleire, de Guesquiere, et al., 1991
Daeseleire, E.; de Guesquiere, A.; van Peteghem, C., Derivatization and gas chromatographic-mass spectrometric detection of anabolic steroid residues isolated from edible muscle tissue, J. Chromatogr., 1991, 562, 1-2, 673-679, https://doi.org/10.1016/0378-4347(91)80617-L . [all data]