4-tert-butyl-2-sec-butylphenol

Kovats' RI, non-polar column, isothermal

Data compiled by: NIST Mass Spectrometry Data Center, William E. Wallace, director

Column type Packed
Active phase SE-30
Column length (m) 3.
Carrier gas He
Substrate NAWHMDS
Column diameter (mm)
Phase thickness (μm)
Temperature (C) 250.
I 1590.
ReferenceVerevkin, Nesterov, et al., 1990
Comment MSDC-RI

References

Verevkin, Nesterov, et al., 1990
Verevkin, S.P.; Nesterov, O.A.; Rempel, P.D.; Synkova, N.V.; Shashkin, N.P., Chromatographic determination of the products of condensation of alkylphenols with formic aldehyde, Zh. Anal. Khim., 1990, 43, 760-761. [all data]