PGD2 TMS

Kovats' RI, non-polar column, isothermal

Data compiled by: NIST Mass Spectrometry Data Center, William E. Wallace, director

Column type Packed
Active phase Dexsil 300
Column length (m)
Carrier gas
Substrate
Column diameter (mm)
Phase thickness (μm)
Temperature (C) 270.
I 2734.
ReferenceTusell and Gelpi, 1980
Comment MSDC-RI

References

Tusell and Gelpi, 1980
Tusell, J.M.; Gelpi, E., Prostaglandins E and F, and 19-Hydroxylated E and F (Series I and II) in Semen of Fertile Men. Gas and Liquid Chromatographic Separation with Selected Ion Detection, J. Chromatogr., 1980, 181, 3-4, 295-310, https://doi.org/10.1016/S0378-4347(00)81132-9 . [all data]