PGA2 TMS

Kovats' RI, non-polar column, isothermal

View large format table.

Column type Active phase Temperature (C) I Reference Comment
PackedDexsil 300270.3038.Tusell and Gelpi, 1980

References

Tusell and Gelpi, 1980
Tusell, J.M.; Gelpi, E., Prostaglandins E and F, and 19-Hydroxylated E and F (Series I and II) in Semen of Fertile Men. Gas and Liquid Chromatographic Separation with Selected Ion Detection, J. Chromatogr., 1980, 181, 3-4, 295-310, https://doi.org/10.1016/S0378-4347(00)81132-9 . [all data]