5B-Androstan-3A,16B,17B-triol, tris-TMS

Van Den Dool and Kratz RI, non-polar column, temperature ramp

Data compiled by: NIST Mass Spectrometry Data Center, William E. Wallace, director

Column type CapillaryPacked
Active phase SE-30SE-30
Column length (m) 20.1.5
Carrier gas He
Substrate  Chromosorb W AW DMCS
Column diameter (mm)
Phase thickness (μm)
Tstart (C) 150.200.
Tend (C) 295.
Heat rate (K/min) 2.1.
Initial hold (min)
Final hold (min)
I 2798.2803.
ReferenceLudwig-Köhn, Sziedat, et al., 1980Grote and Spiteller, 1977
Comment MSDC-RI MSDC-RI

References

Ludwig-Köhn, Sziedat, et al., 1980
Ludwig-Köhn, H.; Sziedat, A.; Spiteller, G.; Matthaei, D.; Henning, H.V.; Scheler, F., Occurrence of highly oxygen-substituted androgens in hemofiltrates of uremic patients, Biomed. Mass Spectrom., 1980, 7, 7, 284-287, https://doi.org/10.1002/bms.1200070704 . [all data]

Grote and Spiteller, 1977
Grote, H.; Spiteller, G., Location of Functional Groups with the Aid of Mass Spectrometry. XVI-Mass Spectra of Trimethylsilylated Androstan-3,16,17β-triols, Biomed. Mass Spectrom., 1977, 4, 4, 216-219, https://doi.org/10.1002/bms.1200040405 . [all data]