3α,16α,17β-Trihydroxy-5β-androstane, tris-TMS

Van Den Dool and Kratz RI, non-polar column, temperature ramp

View large format table.

Column type Active phase I Reference Comment
CapillarySE-302752.Ludwig-Köhn, Sziedat, et al., 1980He, 2. K/min; Column length: 20. m; Tstart: 150. C; Tend: 295. C
PackedSE-302753.Grote and Spiteller, 1977Chromosorb W AW DMCS, 1. K/min; Column length: 1.5 m; Tstart: 200. C

References

Ludwig-Köhn, Sziedat, et al., 1980
Ludwig-Köhn, H.; Sziedat, A.; Spiteller, G.; Matthaei, D.; Henning, H.V.; Scheler, F., Occurrence of highly oxygen-substituted androgens in hemofiltrates of uremic patients, Biomed. Mass Spectrom., 1980, 7, 7, 284-287, https://doi.org/10.1002/bms.1200070704 . [all data]

Grote and Spiteller, 1977
Grote, H.; Spiteller, G., Location of Functional Groups with the Aid of Mass Spectrometry. XVI-Mass Spectra of Trimethylsilylated Androstan-3,16,17β-triols, Biomed. Mass Spectrom., 1977, 4, 4, 216-219, https://doi.org/10.1002/bms.1200040405 . [all data]