o-Synephrine, N-DTFMB-TMS

Normal alkane RI, non-polar column, temperature ramp

Data compiled by: NIST Mass Spectrometry Data Center, William E. Wallace, director

Column type Capillary
Active phase Methyl Silicone
Column length (m) 12.5
Carrier gas He
Substrate
Column diameter (mm) 0.20
Phase thickness (μm)
Tstart (C) 100.
Tend (C) 280.
Heat rate (K/min) 20.
Initial hold (min) 1.
Final hold (min)
I 2152.
ReferenceMidgley, MacLachlan, et al., 1988
Comment MSDC-RI

References

Midgley, MacLachlan, et al., 1988
Midgley, J.M.; MacLachlan, J.; Watson, D.G., An extraction-derivatization method suitable for the analysis of biogenic amines by gas chromatography negative ion mass spectrometry, Biomed. Environ. Mass Spectrom., 1988, 15, 10, 535-539, https://doi.org/10.1002/bms.1200151005 . [all data]