5A-Pregnanolone myristate

Normal alkane RI, non-polar column, temperature ramp

View large format table.

Column type Active phase I Reference Comment
CapillaryBP-14140.Evershed and Goad, 198812. m/0.22 mm/0.10 μm, He, 8. K/min; Tstart: 25. C; Tend: 330. C

References

Evershed and Goad, 1988
Evershed, R.P.; Goad, L.J., Capillary gas chromatography/mass spectrometry of intact fatty acyl esters of pregnane steroids, Biomed. Environ. Mass Spectrom., 1988, 16, 1-12, 169-174, https://doi.org/10.1002/bms.1200160130 . [all data]