Poligodial + o-Tyr (ethyl ester) adduct (R,S)

Normal alkane RI, non-polar column, custom temperature program

View large format table.

Column type Active phase I Reference Comment
CapillaryCP Sil 5 CB2985.Brooks, Brindle, et al., 1988He; Column length: 25. m; Column diameter: 0.32 mm; Program: 80 0C (1 min) 30 K/min -> 160 0C 2 K/min -> 260 0C

References

Brooks, Brindle, et al., 1988
Brooks, C.J.W.; Brindle, P.A.; Cole, W.J.; Watson, D.G., Note. Analytical separations of enantiomeric primary amines as pyrrole derivatives formed by reaction with polygodial, J. Chromatogr., 1988, 438, 108-110, https://doi.org/10.1016/S0021-9673(00)90239-5 . [all data]