3-Hexen-1-ol, butanoate

Kovats' RI, non-polar column, temperature ramp

View large format table.

Column type Active phase I Reference Comment
CapillaryBP-11175.Bartley, 1988He, 2. K/min; Column length: 50. m; Tstart: -100. C; Tend: 200. C

Normal alkane RI, non-polar column, temperature ramp

View large format table.

Column type Active phase I Reference Comment
CapillaryHP-51186.Simic, Sokovic, et al., 200425. m/0.32 mm/0.52 μm, H2, 4. K/min; Tstart: 40. C; Tend: 240. C

References

Bartley, 1988
Bartley, J.P., Volatile flavours of Australian tropical fruits, Biomed. Environ. Mass Spectrom., 1988, 16, 1-12, 201-205, https://doi.org/10.1002/bms.1200160136 . [all data]

Simic, Sokovic, et al., 2004
Simic, A.; Sokovic, M.D.; Ristic, M.; Grujic-Jovanovic, S.; Vukojevic, J.; Marin, P.D., The chemical composition of some Lauraceae essential oils and their antifungal activities, Phytother. Res., 2004, 18, 9, 713-717, https://doi.org/10.1002/ptr.1516 . [all data]