2-Methylpentane-2,4-diol, ferrocenylboronate

Kovats' RI, non-polar column, isothermal

View large format table.

Column type Active phase Temperature (C) I Reference Comment
PackedOV-1150.1885.Brooks and Cole, 1987N2, Gas-Chrom Q (100-120 mesh); Column length: 1.8 m

References

Brooks and Cole, 1987
Brooks, C.J.W.; Cole, W.J., Cyclic ferroceneboronates as derivatives for the gas chromatographic separation and characterisation of diols and related compounds, J. Chromatogr., 1987, 399, 207-221, https://doi.org/10.1016/S0021-9673(00)96123-5 . [all data]