2-butyl-4,5-diethyloxazole

Van Den Dool and Kratz RI, non-polar column, temperature ramp

Data compiled by: NIST Mass Spectrometry Data Center, William E. Wallace, director

Column type Capillary
Active phase SPD-1
Column length (m) 60.
Carrier gas
Substrate
Column diameter (mm) 0.25
Phase thickness (μm)
Tstart (C) 50.
Tend (C) 280.
Heat rate (K/min) 2.
Initial hold (min) 5.
Final hold (min) 30.
I 1292.
ReferenceCarlin, Jin, et al., 1986
Comment MSDC-RI

References

Carlin, Jin, et al., 1986
Carlin, J.T.; Jin, Q.Z.; Huang, T.-C.; Ho, C.-T.; Chang, S.S., Identification of alkyloxazoles, in the volatile compounds from french-fried potatoes, J. Agric. Food Chem., 1986, 34, 4, 621-623, https://doi.org/10.1021/jf00070a008 . [all data]