Physcion-9-anthrone, TMS

Kovats' RI, non-polar column, temperature ramp

Data compiled by: NIST Mass Spectrometry Data Center, William E. Wallace, director

Column type Capillary
Active phase DB-1
Column length (m) 15.
Carrier gas He
Substrate
Column diameter (mm) 0.25
Phase thickness (μm)
Tstart (C) 200.
Tend (C) 300.
Heat rate (K/min) 6.
Initial hold (min)
Final hold (min)
I 2652.
ReferenceLewis and Shibamoto, 1985
Comment MSDC-RI

References

Lewis and Shibamoto, 1985
Lewis, D.C.; Shibamoto, T., Analysis of toxic anthraquinones and related compounds with fused silica capillary column, J. Hi. Res. Chromatogr. Chromatogr. Comm., 1985, 8, 6, 280-282, https://doi.org/10.1002/jhrc.1240080602 . [all data]