2-(tert-Butyl-dimethyl-silanyloxy)- 3-(1-methylpropyl)-quinoxaline

Van Den Dool and Kratz RI, non-polar column, temperature ramp

View large format table.

Column type Active phase I Reference Comment
PackedOV-1011900.Langenbeck, Luthe, et al., 1985N2, Chrom W-AWDM-CS, 2. K/min; Column length: 1.8 m; Tstart: 50. C; Tend: 200. C

References

Langenbeck, Luthe, et al., 1985
Langenbeck, U.; Luthe, H.; Schaper, G., Keto acids in tissues and biological fluids: O-t-butyldimethylsilyl quinoxalinols as derivatives for sensitive gas chromatographic/mass spectrometric determination, Biomed. Mass Spectrom., 1985, 12, 9, 507-509, https://doi.org/10.1002/bms.1200120912 . [all data]