Pyrazolo[1,5-d][1,2,4]triazin-3-one, 2,6-dimethyl-7-phenyl

Kovats' RI, non-polar column, isothermal

View large format table.

Column type Active phase Temperature (C) I Reference Comment
PackedOV-101220.2047.Szederkényi, Tihanyi, et al., 1984N2, Gas Chrom Q; Column length: 2. m

References

Szederkényi, Tihanyi, et al., 1984
Szederkényi, F.; Tihanyi, E.; Gál, M.; Fehér, Ö., Gas chromatographic behaviour of substituted 6,7-dihydropyrazolo[1,5-d] [1,2,4]triazin-4(5H)-ones and pyrazolecarboxylic acids hydrazones, J. Chromatogr., 1984, 285, 91-96, https://doi.org/10.1016/S0021-9673(01)87738-4 . [all data]