Z-3-Chloro-2-methyl-prop-2-en-1-ol

Kovats' RI, polar column, isothermal

Data compiled by: NIST Mass Spectrometry Data Center, William E. Wallace, director

Column type Capillary
Active phase Carbowax 20M
Column length (m) 50.
Carrier gas
Substrate
Column diameter (mm) 0.23
Phase thickness (μm)
Temperature (C) 100.
I 1566.7
ReferencePriboth, Engewald, et al., 1984
Comment MSDC-RI

References

Priboth, Engewald, et al., 1984
Priboth, I.; Engewald, W.; Schulze, K.; Schulze, B., Gas chromatographic retention behaviour of Z/E-isomeric chloroallyl and chlorovinyl compounds, J. Chromatogr., 1984, 294, 334-338, https://doi.org/10.1016/S0021-9673(01)96139-4 . [all data]