Tripropylene glycol, diacetate

Van Den Dool and Kratz RI, non-polar column, temperature ramp

View large format table.

Column type Active phase I Reference Comment
PackedSE-301598.Gnauck, 1984N2, Chromosorb W AW DMCS, 10. K/min; Column length: 2. m; Tstart: 50. C
PackedSE-301604.Gnauck, 1984N2, Chromosorb W AW DMCS, 4. K/min; Column length: 2. m; Tstart: 50. C
PackedSE-301600.Gnauck, 1984N2, Chromosorb W AW DMCS, 6. K/min; Column length: 2. m; Tstart: 50. C
PackedSE-301598.Gnauck, 1984N2, Chromosorb W AW DMCS, 8. K/min; Column length: 2. m; Tstart: 50. C
PackedSE-301595.Gnauck, 1984N2, Chromosorb W AW DMCS, 10. K/min; Column length: 2. m; Tstart: 70. C
PackedSE-301600.Gnauck, 1984N2, Chromosorb W AW DMCS, 4. K/min; Column length: 2. m; Tstart: 70. C
PackedSE-301596.Gnauck, 1984N2, Chromosorb W AW DMCS, 6. K/min; Column length: 2. m; Tstart: 70. C
PackedSE-301597.Gnauck, 1984N2, Chromosorb W AW DMCS, 8. K/min; Column length: 2. m; Tstart: 70. C
PackedSE-301600.Gnauck, 1984N2, Chromosorb W AW DMCS, 10. K/min; Column length: 2. m; Tstart: 90. C
PackedSE-301602.Gnauck, 1984N2, Chromosorb W AW DMCS, 4. K/min; Column length: 2. m; Tstart: 90. C
PackedSE-301599.Gnauck, 1984N2, Chromosorb W AW DMCS, 6. K/min; Column length: 2. m; Tstart: 90. C
PackedSE-301597.Gnauck, 1984N2, Chromosorb W AW DMCS, 8. K/min; Column length: 2. m; Tstart: 90. C

Normal alkane RI, non-polar column, temperature ramp

View large format table.

Column type Active phase I Reference Comment
CapillaryUltra-11560.Okumura, 199125. m/0.32 mm/0.25 μm, He, 3. K/min; Tstart: 80. C; Tend: 260. C
CapillaryUltra-11562.Okumura, 199125. m/0.32 mm/0.25 μm, He, 3. K/min; Tstart: 80. C; Tend: 260. C
CapillaryUltra-11567.Okumura, 199125. m/0.32 mm/0.25 μm, He, 3. K/min; Tstart: 80. C; Tend: 260. C
CapillaryUltra-11572.Okumura, 199125. m/0.32 mm/0.25 μm, He, 3. K/min; Tstart: 80. C; Tend: 260. C
CapillaryUltra-11574.Okumura, 199125. m/0.32 mm/0.25 μm, He, 3. K/min; Tstart: 80. C; Tend: 260. C
CapillaryUltra-11578.Okumura, 199125. m/0.32 mm/0.25 μm, He, 3. K/min; Tstart: 80. C; Tend: 260. C

References

Gnauck, 1984
Gnauck, R., Gaschromatographische Trennung und Identifizierung Polyfunktioneller Polyetheralkohole, J. Chromatogr., 1984, 284, 87-96, https://doi.org/10.1016/S0021-9673(01)87804-3 . [all data]

Okumura, 1991
Okumura, T., retention indices of environmental chemicals on methyl silicone capillary column, Journal of Environmental Chemistry (Japan), 1991, 1, 2, 333-358, https://doi.org/10.5985/jec.1.333 . [all data]