7β,18-diOH-kaurenolide, TMS

Van Den Dool and Kratz RI, non-polar column, custom temperature program

Data compiled by: NIST Mass Spectrometry Data Center, William E. Wallace, director

Column type Capillary
Active phase OV-1
Column length (m) 25.
Carrier gas He
Substrate
Column diameter (mm) 0.2
Phase thickness (μm)
Program 60C(2min) => 13C/min => 150C => 3C/min => 280C(10min)
I 2645.
ReferenceGaskin, Gilmour, et al., 1984
Comment MSDC-RI

References

Gaskin, Gilmour, et al., 1984
Gaskin, P.; Gilmour, S.J.; Lenton, J.R.; MacMillan, J.; Sponsel, V.M., Endogenous gibberellins and kauranoids identified from developing and germinating barley grain, J. Plant Growth Regul., 1984, 2, 1-4, 229-242, https://doi.org/10.1007/BF02042252 . [all data]