7,10-dodecadien-1-ol

Kovats' RI, non-polar column, isothermal

Data compiled by: NIST Mass Spectrometry Data Center, William E. Wallace, director

Column type Packed
Active phase OV-101
Column length (m) 1.
Carrier gas
Substrate Chromaton N-AW
Column diameter (mm)
Phase thickness (μm)
Temperature (C) 130.
I 1429.
ReferenceBerezkin and Returnsky, 1984
Comment MSDC-RI

References

Berezkin and Returnsky, 1984
Berezkin, V.G.; Returnsky, V.N., Calculation of invariant retention indices for a series of aliphatic alcohols and acetates by consideration of adsorption at the interface, J. Chromatogr., 1984, 292, 1, 9-17, https://doi.org/10.1016/S0021-9673(01)96185-0 . [all data]