11-Tetradecen-1-ol

Kovats' RI, non-polar column, isothermal

View large format table.

Column type Active phase Temperature (C) I Reference Comment
PackedOV-101130.1624.Berezkin and Returnsky, 1984Chromaton N-AW; Column length: 1. m

References

Berezkin and Returnsky, 1984
Berezkin, V.G.; Returnsky, V.N., Calculation of invariant retention indices for a series of aliphatic alcohols and acetates by consideration of adsorption at the interface, J. Chromatogr., 1984, 292, 1, 9-17, https://doi.org/10.1016/S0021-9673(01)96185-0 . [all data]