1,3-Benzenedicarboxylic acid, dipentyl ester

Kovats' RI, non-polar column, isothermal

Data compiled by: NIST Mass Spectrometry Data Center, William E. Wallace, director

Column type CapillaryCapillaryCapillary
Active phase OV-101OV-101SE-30
Column length (m) 50.50.50.
Carrier gas N2H2He
Substrate
Column diameter (mm) 0.30.30.3
Phase thickness (μm) 0.350.350.39
Temperature (C) 230.230.251.
I 2219.2219.2222.
ReferenceFriocourt, Berthou, et al., 1979Friocourt, Berthou, et al., 1979Friocourt, Berthou, et al., 1979
Comment MSDC-RI MSDC-RI MSDC-RI

References

Friocourt, Berthou, et al., 1979
Friocourt, M.P.; Berthou, F.; Picart, D.; Dreano, Y.; Floch, H.H., Glass Capillary Column Gas Chromatography of Phthalate Esters, J. Chromatogr., 1979, 172, 1, 261-271, https://doi.org/10.1016/S0021-9673(00)90961-0 . [all data]