5-α-Pregnane-20-β,21-diol, bis-TMS

Normal alkane RI, non-polar column, custom temperature program

Data compiled by: NIST Mass Spectrometry Data Center, William E. Wallace, director

Column type Capillary
Active phase OV-1
Column length (m) 25.
Carrier gas
Substrate
Column diameter (mm) 0.25
Phase thickness (μm) 0.25
Program 80 0C (5 min) 40 K/min -> 120 0C (2 min) 2 K/min -> 200 0C (for androstanes), or 80 0C (5 min) 40 K/min -> 190 0C (2 min) 2 K/min -> 270 0C (for sterols)
I 2800.
ReferenceBrooks, Cole, et al., 1983
Comment MSDC-RI

References

Brooks, Cole, et al., 1983
Brooks, C.J.W.; Cole, W.J.; Lawrie, T.D.V.; MacLachlan, J.; Borthwick, J.H.; Barrett, G.M., Selective reactions in the analytical characterisation of steroids by gas chromatography-mass spectrometry, J. Steroid Biochem., 1983, 19, 1, 189-201, https://doi.org/10.1016/S0022-4731(83)80025-9 . [all data]