5-Chlorodecane

Kovats' RI, non-polar column, isothermal

Data compiled by: NIST Mass Spectrometry Data Center, William E. Wallace, director

Column type Packed
Active phase Apiezon L
Column length (m)
Carrier gas
Substrate
Column diameter (mm)
Phase thickness (μm)
Temperature (C) 150.
I 1200.
ReferenceJaworski, 1982
Comment MSDC-RI

References

Jaworski, 1982
Jaworski, M., Wybrane przyklady stosowania systemu indeksów retencji, Przem. Chem., 1982, 61, 9, 334-338. [all data]