3,5-Bis(trifluoromethyl)benzeneboronate, guaifenesin

Kovats' RI, non-polar column, isothermal

View large format table.

Column type Active phase Temperature (C) I Reference Comment
PackedSE-30240.2081.Singhawangcha, Poole, et al., 1980N2, Gas-Chrom Q; Column length: 1. m

References

Singhawangcha, Poole, et al., 1980
Singhawangcha, S.; Poole, C.F.; Zlatkis, A., The Determination of Bifunctional Compounds. IX . A Selective Reaction for the Determination of Guaifenesin in Plasma by Gas Chromatography, J. Chromatogr., 1980, 183, 4, 433-439, https://doi.org/10.1016/S0378-4347(00)81585-6 . [all data]