trichloroacetic acid, stearyl ester

Kovats' RI, non-polar column, isothermal

View large format table.

Column type Active phase Temperature (C) I Reference Comment
PackedSE-30200.2571.Golovkin, Smol'chenko, et al., 1980N2, Chromaton N-AW-DMCS; Column length: 1. m

Van Den Dool and Kratz RI, non-polar column, custom temperature program

View large format table.

Column type Active phase I Reference Comment
CapillaryDB-12588.Peng, 200015. m/0.53 mm/1. μm, He; Program: 40C(3min) => 8C/min => 200(1min) => 5C/min => 300C(25min)

Van Den Dool and Kratz RI, polar column, temperature ramp

View large format table.

Column type Active phase I Reference Comment
CapillaryDB-Wax2987.Peng, 200015. m/0.53 mm/1. μm, He, 40. C @ 3. min, 5. K/min, 220. C @ 30. min

References

Golovkin, Smol'chenko, et al., 1980
Golovkin, G.V.; Smol'chenko, A.I.; Zotov, L.N.; Sazonov, S.E., Systems of gas-chromatographic retention indices for identifying pesticides by means of selective detectors, Zh. Anal. Khim., 1980, 35, 5, 651-655. [all data]

Peng, 2000
Peng, C.T., Prediction of retention indices. V. Influence of electronic effects and column polarity on retention index, J. Chromatogr. A, 2000, 903, 1-2, 117-143, https://doi.org/10.1016/S0021-9673(00)00901-8 . [all data]