Xanthine, 1-(5'-hydroxyhexyl)-3,7-dimethyl

Kovats' RI, non-polar column, isothermal

View large format table.

Column type Active phase Temperature (C) I Reference Comment
PackedOV-1240.2430.Bryce and Burrows, 1980Chromosorb W HP (100-120 mesh); Column length: 2. m

References

Bryce and Burrows, 1980
Bryce, T.A.; Burrows, J.L., Determination of Oxpentifylline and a Metabolite, 1-(5'-Hydroxyhexyl)-3, 7-Dimethylxanthine, by Gas-Liquid Chromatography Using a Nitrogen-Selective Detector, J. Chromatogr., 1980, 181, 3-4, 355-361, https://doi.org/10.1016/S0378-4347(00)81138-X . [all data]