5-β-Pregnan-3-α,20-α-diol, TMS

Kovats' RI, non-polar column, isothermal

Data compiled by: NIST Mass Spectrometry Data Center, William E. Wallace, director

Column type PackedPackedPackedCapillaryCapillary
Active phase OV-1OV-1OV-101OV-101OV-101
Column length (m) 1.1.2.155.55.
Carrier gas
Substrate Gas Chrom QGas Chrom Q
Column diameter (mm)    0.370.37
Phase thickness (μm)
Temperature (C) 230.260.207.252.252.
I 2783.2817.2777.2794.2797.
ReferenceQuilliam and Westmore, 1978Quilliam and Westmore, 1978Berthou, Picart, et al., 1976Berthou, Picart, et al., 1976Berthou, Picart, et al., 1976
Comment MSDC-RI MSDC-RI MSDC-RI MSDC-RI MSDC-RI

References

Quilliam and Westmore, 1978
Quilliam, M.A.; Westmore, J.B., Sterically crowded trialkylsilyl derivatives for chromatography and mass spectrometry of biologically-important compounds, Anal. Chem., 1978, 50, 1, 59-68, https://doi.org/10.1021/ac50023a020 . [all data]

Berthou, Picart, et al., 1976
Berthou, F.; Picart, D.; Bardou, L.; Floch, H.H., Separation of C19 and C21 dihydroxysteroids by open-hole tubular glass columns and lipophilic gel chromatography, J. Chromatogr., 1976, 118, 2, 135-155, https://doi.org/10.1016/S0021-9673(00)81203-0 . [all data]