Cyclopentane, 1-methyl-2-(1-methylpropyl)

Kovats' RI, non-polar column, isothermal

View large format table.

Column type Active phase Temperature (C) I Reference Comment
PackedSqualane100.952.Bogoslovsky, Anvaer, et al., 1978
PackedSqualane120.956.Bogoslovsky, Anvaer, et al., 1978
PackedSqualane80.948.Bogoslovsky, Anvaer, et al., 1978

References

Bogoslovsky, Anvaer, et al., 1978
Bogoslovsky, Yu.N.; Anvaer, B.I.; Vigdergauz, M.S., Chromatographic constants in gas chromatography (in Russian), Standards Publ. House, Moscow, 1978, 192. [all data]