1,2-dimethyl-3-ethylcyclopentane

Kovats' RI, non-polar column, isothermal

Data compiled by: NIST Mass Spectrometry Data Center, William E. Wallace, director

Column type PackedCapillary
Active phase SqualaneSqualane
Column length (m)  120.
Carrier gas  He
Substrate
Column diameter (mm)  0.25
Phase thickness (μm)
Temperature (C) 75.100.
I 853.853.
ReferenceBogoslovsky, Anvaer, et al., 1978Lulova, Leont'eva, et al., 1976
Comment MSDC-RI MSDC-RI

References

Bogoslovsky, Anvaer, et al., 1978
Bogoslovsky, Yu.N.; Anvaer, B.I.; Vigdergauz, M.S., Chromatographic constants in gas chromatography (in Russian), Standards Publ. House, Moscow, 1978, 192. [all data]

Lulova, Leont'eva, et al., 1976
Lulova, N.I.; Leont'eva, S.A.; Timofeeva, A.N., Gas-chromatographic method of determination of individual hydrocarbons in catalytic cracking gasolines in Proceedings of All-Union Research Institute on Oil Processes. Vol.18, All-Union Research Institute on Oil Processes, Moscow, 1976, 30-53. [all data]