2,4,5-TP, PFB

Kovats' RI, non-polar column, isothermal

View large format table.

Column type Active phase Temperature (C) I Reference Comment
PackedDC-200210.2173.de Beer, van Peteghem, et al., 1978
PackedDC-200210.2179.de Beer, van Peteghem, et al., 1978

Kovats' RI, polar column, isothermal

View large format table.

Column type Active phase Temperature (C) I Reference Comment
PackedFFAP210.2902.de Beer, van Peteghem, et al., 1978Column length: 1.8 m
PackedFFAP210.2902.de Beer, van Peteghem, et al., 1978Column length: 1.8 m

Normal alkane RI, non-polar column, isothermal

View large format table.

Column type Active phase Temperature (C) I Reference Comment
PackedDC-200210.2170.De Beer, Van Peteghem, et al., 1977N2, Varaport 30 (100-120 mesh); Column length: 1.8 m

Normal alkane RI, polar column, isothermal

View large format table.

Column type Active phase Temperature (C) I Reference Comment
PackedFFAP210.2936.De Beer, Van Peteghem, et al., 1977N2, Varaport 30 (100-120 mesh); Column length: 1.8 m

References

de Beer, van Peteghem, et al., 1978
de Beer, J.; van Peteghem, C.; Heyndrickx, A., Comparative Study of the Gas-Liquid Chromatographic Behaviour of the Pentafluorobenzyl Esters and the Methyl Esters of Ten Chlorophenoxyalkyl Acids, J. Chromatogr., 1978, 157, 97-110, https://doi.org/10.1016/S0021-9673(00)92325-2 . [all data]

De Beer, Van Peteghem, et al., 1977
De Beer, J.; Van Peteghem, C.; Heyndrickx, A., Gas-liquid chromatographic properties of ten chlorophenoxyalkyl acids after derivation with pentafluorobenzyl bromide, Med. Fac. Landbouww. Rijksuniv. Gent., 1977, 42, 2, 1739-1752. [all data]