1-(1-phenylcyclohexyl)-3-hydroxypiperidine

Kovats' RI, non-polar column, custom temperature program

View large format table.

Column type Active phase I Reference Comment
PackedOV-1012393.Lin, Fendiman, et al., 1975Chromosorb Q; Column length: 1.52 m; Program: not specified

References

Lin, Fendiman, et al., 1975
Lin, D.C.K.; Fendiman, A.F., Jr.; Foltz, R.L.; Forney, R.D., Jr.; Sunshine, I., Quantification of phencyclidine in body fluids by gas chromatography chemical ionization mass spectrometry and identification of two metabolites, Biomed. Mass Spectrom., 1975, 2, 4, 206-214, https://doi.org/10.1002/bms.1200020409 . [all data]