Chloro(tripropyloxy)silane

Kovats' RI, non-polar column, isothermal

Data compiled by: NIST Mass Spectrometry Data Center, William E. Wallace, director

Column type PackedPacked
Active phase SE-30SE-30
Column length (m) 1.1.
Carrier gas ArAr
Substrate
Column diameter (mm)
Phase thickness (μm)
Temperature (C) 100.150.
I 1190.1165.
ReferenceKreshkov, Kirichenko, et al., 1975Kreshkov, Kirichenko, et al., 1975
Comment MSDC-RI MSDC-RI

References

Kreshkov, Kirichenko, et al., 1975
Kreshkov, A.P.; Kirichenko, É.A.; Markov, B.A., Retention indices of alkoxychlorosilanes, Zh. Anal. Khim., 1975, 30, 2, 286-289. [all data]