Normethanephrine, N-TFA-O-TMS

Kovats' RI, non-polar column, isothermal

View large format table.

Column type Active phase Temperature (C) I Reference Comment
PackedOV-101270.1888.Donike, 1975He, Chromosorb W AW DMCS; Column length: 1.5 m

References

Donike, 1975
Donike, M., N-trifluoracetyl-o-trimethylsilyl-phenolalkylamine. Darstellung und massenspezifischer gaschromatographischer nachweis, J. Chromatogr., 1975, 103, 1, 91-112, https://doi.org/10.1016/S0021-9673(00)83805-4 . [all data]