1-methyl-cis-2-propyl-cyclopropane

Kovats' RI, non-polar column, isothermal

Data compiled by: NIST Mass Spectrometry Data Center, William E. Wallace, director

Column type PackedCapillary
Active phase SqualaneSqualane
Column length (m)  100.
Carrier gas
Substrate
Column diameter (mm)  0.25
Phase thickness (μm)
Temperature (C) 60.60.
I 702.702.2
ReferenceBogoslovsky, Anvaer, et al., 1978Schomburg and Dielmann, 1973
Comment MSDC-RI MSDC-RI

References

Bogoslovsky, Anvaer, et al., 1978
Bogoslovsky, Yu.N.; Anvaer, B.I.; Vigdergauz, M.S., Chromatographic constants in gas chromatography (in Russian), Standards Publ. House, Moscow, 1978, 192. [all data]

Schomburg and Dielmann, 1973
Schomburg, G.; Dielmann, G., Use of retention increments for identification and correlation of saturated and unsaturated cyclopropane hydrocarbons by means of Kovats indices, Anal. Chem., 1973, 45, 9, 1647-1658, https://doi.org/10.1021/ac60331a021 . [all data]