2-Hydroxy-cyclopentanecarboxylic acid ethyl ester, cis

Kovats' RI, non-polar column, isothermal

View large format table.

Column type Active phase Temperature (C) I Reference Comment
PackedSE-30160.1162.Lászlóné, 1973H2, Gas Chrom Q; Column length: 2. m
PackedSqualane120.1098.Lászlóné, 1973H2, Gas Chrom Q; Column length: 2. m

References

Lászlóné, 1973
Lászlóné, T., Adatok a cisz- és transz-2-OH-ciklokarbonsav-észterek szerkezetének tanulmányozásához, I. A gázkromatográfiás retenciós index és a molekulaszerkezet kapcsolata, Magy. Kem. Foly., 1973, 79, 11, 488-491. [all data]