4-Cyclooct-3-enyl-cyclononene

Kovats' RI, non-polar column, isothermal

View large format table.

Column type Active phase Temperature (C) I Reference Comment
CapillaryApiezon L100.1637.Besson and Gäumann, 1973Column length: 50. m; Column diameter: 0.25 mm

References

Besson and Gäumann, 1973
Besson, R.; Gäumann, T., Indices de rétention de cycloalcanes, cycloalcènes, bicycloalkyles, cycloalkyl-cycloalcényles et bicycloalcényles en chromatographie en phase gazeuse, Helv. Chim. Acta, 1973, 56, 3, 1159-1164, https://doi.org/10.1002/hlca.19730560339 . [all data]