2β-hydroxy-6β-methoxy-trans-decalin

Kovats' RI, polar column, isothermal

Data compiled by: NIST Mass Spectrometry Data Center, William E. Wallace, director

Column type Packed
Active phase Carbowax 20M
Column length (m) 1.
Carrier gas N2
Substrate Gas Chrom Q (80-100 mesh)
Column diameter (mm)
Phase thickness (μm)
Temperature (C) 180.
I 2310.
ReferenceTakeda and Yamamoto, 1972
Comment MSDC-RI

References

Takeda and Yamamoto, 1972
Takeda, K.; Yamamoto, S., Gas chromatographic identification of 2,6-disubstituted-trans-decalins using retention indices, Chem. Pharm. Bull., 1972, 20, 6, 1125-1130, https://doi.org/10.1248/cpb.20.1125 . [all data]